Reaction Details
TargetMonoacylglycerol lipase ABHD6
LigandBDBM50048620
Substrate/Competitorn/a
Meas. Tech.ChEMBL_1449476 (CHEMBL3373892)
Ki 800±n/a nM
Citation Janssen, FJDeng, HBaggelaar, MPAllarà, Mvan der Wel, Tden Dulk, HLigresti, Avan Esbroeck, ACMcGuire, RDi Marzo, VOverkleeft, HSvan der Stelt, M Discovery of glycine sulfonamides as dual inhibitors of sn-1-diacylglycerol lipasea anda/ß-hydrolase domain 6. J Med Chem57:6610-22 (2014) 
 
Monoacylglycerol lipase ABHD6
Name:Monoacylglycerol lipase ABHD6
Type:PROTEIN
Mol. Mass.:38341.83
Organism:Homo sapiens (Human)
Description:ChEMBL_105457
Residue:337
BDBM50048620
NameBDBM50048620
Synonyms:CHEMBL3319620
TypeSmall organic molecule
Emp. Form.C26H27NO6S
Mol. Mass.481.561
SMILESCC1(C)CCc2cc(ccc2O1)S(=O)(=O)N(CC(O)=O)Cc1ccc(Oc2ccccc2)cc1