Reaction Details
TargetUrotensin-2 receptor
LigandBDBM50048696
Substrate/Competitorn/a
Meas. Tech.ChEMBL_1451067 (CHEMBL3366482)
EC50 5.0±n/a nM
Citation Carotenuto, AAuriemma, LMerlino, FYousif, AMMarasco, DLimatola, ACampiglia, PGomez-Monterrey, ISanticioli, PMeini, SMaggi, CANovellino, EGrieco, P Lead optimization of P5U and urantide: discovery of novel potent ligands at the urotensin-II receptor. J Med Chem57:5965-74 (2014) 
 
Urotensin-2 receptor
Name:Urotensin-2 receptor
Type:Enzyme Catalytic Domain
Mol. Mass.:42725.34
Organism:RAT
Description:Urotensin-II UTS2R RAT::P49684
Residue:386
BDBM50048696
NameBDBM50048696
Synonyms:CHEMBL3315142
TypeSmall organic molecule
Emp. Form.C56H70N10O11S2
Mol. Mass.1123.345
SMILESCC(C)[C@H](NC(=O)[C@@H]1CSSC(C)(C)[C@H](NC(=O)[C@@H](N)CC(O)=O)C(=O)N[C@@H](Cc2ccccc2)C(=O)N[C@@H](Cc2c[nH]c3ccccc23)C(=O)N[C@@H](CCCCN)C(=O)N[C@@H](Cc2cccc3ccccc23)C(=O)N1)C(O)=O