Reaction Details
TargetAryl hydrocarbon receptor
LigandBDBM50049061
Substrate/Competitorn/a
Meas. Tech.ChEMBL_1453812 (CHEMBL3365189)
EC50 55±n/a nM
Citation Winston-McPherson, GNShu, DTang, W Synthesis and biological evaluation of 2,3'-diindolylmethanes as agonists of aryl hydrocarbon receptor. Bioorg Med Chem Lett24:4023-5 (2014) 
 
Aryl hydrocarbon receptor
Name:Aryl hydrocarbon receptor
Type:PROTEIN
Mol. Mass.:96143.77
Organism:Homo sapiens (Human)
Description:ChEMBL_1503828
Residue:848
BDBM50049061
NameBDBM50049061
Synonyms:CHEMBL3319501 US9969686, Compound 11d
TypeSmall organic molecule
Emp. Form.C19H16N2O
Mol. Mass.288.3431
SMILESCn1cc(Cc2[nH]c3ccccc3c2C=O)c2ccccc12