Reaction Details
TargetAryl hydrocarbon receptor
LigandBDBM50049064
Substrate/Competitorn/a
Meas. Tech.ChEMBL_1453812 (CHEMBL3365189)
EC50 93±n/a nM
Citation Winston-McPherson, GNShu, DTang, W Synthesis and biological evaluation of 2,3'-diindolylmethanes as agonists of aryl hydrocarbon receptor. Bioorg Med Chem Lett24:4023-5 (2014) 
 
Aryl hydrocarbon receptor
Name:Aryl hydrocarbon receptor
Type:PROTEIN
Mol. Mass.:96143.77
Organism:Homo sapiens (Human)
Description:ChEMBL_1503828
Residue:848
BDBM50049064
NameBDBM50049064
Synonyms:CHEMBL3319498 US9969686, Compound 11a
TypeSmall organic molecule
Emp. Form.C18H13ClN2O
Mol. Mass.308.762
SMILESClc1ccc2[nH]cc(Cc3[nH]c4ccccc4c3C=O)c2c1