Reaction Details
TargetTransient receptor potential cation channel subfamily V member 1
LigandBDBM50049539
Substrate/Competitorn/a
Meas. Tech.ChEMBL_1451141 (CHEMBL3361606)
Ki 1.4±n/a nM
Citation Ryu, HSeo, SKim, MSKim, MYKim, HSAnn, JTran, PTHoang, VHByun, JCui, MSon, KSharma, PKChoi, SBlumberg, PMFrank-Foltyn, RBahrenberg, GKoegel, BYChristoph, TFrormann, SLee, J 2-Aryl substituted pyridine C-region analogues of 2-(3-fluoro-4-methylsulfonylaminophenyl)propanamides as highly potent TRPV1 antagonists. Bioorg Med Chem Lett24:4044-7 (2014) 
 
Transient receptor potential cation channel subfamily V member 1
Name:Transient receptor potential cation channel subfamily V member 1
Type:Protein
Mol. Mass.:94960.75
Organism:Homo sapiens (Human)
Description:Q8NER1
Residue:839
BDBM50049539
NameBDBM50049539
Synonyms:CHEMBL3317494
TypeSmall organic molecule
Emp. Form.C25H25F4N3O3S
Mol. Mass.523.543
SMILESCC(C(=O)NCc1ccc(nc1CCc1ccccc1)C(F)(F)F)c1ccc(NS(C)(=O)=O)c(F)c1