Reaction Details
TargetCholinesterase
LigandBDBM50448131
Substrate/Competitorn/a
Meas. Tech.ChEMBL_1455579 (CHEMBL3364956)
IC50 920±n/a nM
Citation Di Pietro, OPérez-Areales, FJJuárez-Jiménez, JEspargaró, AClos, MVPérez, BLavilla, RSabaté, RLuque, FJMuñoz-Torrero, D Tetrahydrobenzo[h][1,6]naphthyridine-6-chlorotacrine hybrids as a new family of anti-Alzheimer agents targetingß-amyloid, tau, and cholinesterase pathologies. Eur J Med Chem84:107-17 (2014) 
 
Cholinesterase
Name:Cholinesterase
Type:Homotetramer
Mol. Mass.:68422.27
Organism:Homo sapiens (Human)
Description:P06276
Residue:602
BDBM50448131
NameBDBM50448131
Synonyms:CHEMBL3122167
TypeSmall organic molecule
Emp. Form.C21H20ClN3O
Mol. Mass.365.856
SMILESCCNC(=O)c1ccc2nc(-c3ccc(Cl)cc3)c3CCCNc3c2c1