Reaction Details
TargetPotassium channel subfamily K member 3
LigandBDBM50050444
Substrate/Competitorn/a
Meas. Tech.ChEMBL_1457493 (CHEMBL3367860)
IC50>3000±n/a nM
Citation Flaherty, DPSimpson, DSMiller, MMaki, BEZou, BShi, JWu, MMcManus, OBAubé, JLi, MGolden, JE Potent and selective inhibitors of the TASK-1 potassium channel through chemical optimization of a bis-amide scaffold. Bioorg Med Chem Lett24:3968-73 (2014) 
 
Potassium channel subfamily K member 3
Name:Potassium channel subfamily K member 3
Type:Protein
Mol. Mass.:43534.71
Organism:Homo sapiens (Human)
Description:O14649
Residue:394
BDBM50050444
NameBDBM50050444
Synonyms:CHEMBL3317849
TypeSmall organic molecule
Emp. Form.C21H15F3N2O2
Mol. Mass.384.3512
SMILESFC(F)(F)c1ccc(cc1)C(=O)Nc1cccc(NC(=O)c2ccccc2)c1