Reaction Details
TargetPotassium channel subfamily K member 9
LigandBDBM50050441
Substrate/Competitorn/a
Meas. Tech.ChEMBL_1457494 (CHEMBL3367861)
IC50>30000±n/a nM
Citation Flaherty, DPSimpson, DSMiller, MMaki, BEZou, BShi, JWu, MMcManus, OBAubé, JLi, MGolden, JE Potent and selective inhibitors of the TASK-1 potassium channel through chemical optimization of a bis-amide scaffold. Bioorg Med Chem Lett24:3968-73 (2014) 
 
Potassium channel subfamily K member 9
Name:Potassium channel subfamily K member 9
Type:PROTEIN
Mol. Mass.:42276.04
Organism:Homo sapiens (Human)
Description:ChEMBL_1457494
Residue:374
BDBM50050441
NameBDBM50050441
Synonyms:CHEMBL3317822
TypeSmall organic molecule
Emp. Form.C20H15ClN2O2
Mol. Mass.350.798
SMILESClc1ccc(cc1)C(=O)Nc1cccc(NC(=O)c2ccccc2)c1