Reaction Details
TargetPotassium channel subfamily K member 9
LigandBDBM50050499
Substrate/Competitorn/a
Meas. Tech.ChEMBL_1457494 (CHEMBL3367861)
IC50>30000±n/a nM
Citation Flaherty, DPSimpson, DSMiller, MMaki, BEZou, BShi, JWu, MMcManus, OBAubé, JLi, MGolden, JE Potent and selective inhibitors of the TASK-1 potassium channel through chemical optimization of a bis-amide scaffold. Bioorg Med Chem Lett24:3968-73 (2014) 
 
Potassium channel subfamily K member 9
Name:Potassium channel subfamily K member 9
Type:PROTEIN
Mol. Mass.:42276.04
Organism:Homo sapiens (Human)
Description:ChEMBL_1457494
Residue:374
BDBM50050499
NameBDBM50050499
Synonyms:CHEMBL3188671
TypeSmall organic molecule
Emp. Form.C22H20N2O3
Mol. Mass.360.4058
SMILESCOc1ccc(cc1)C(=O)Nc1cccc(NC(=O)c2cccc(C)c2)c1