Reaction Details
TargetPotassium voltage-gated channel subfamily KQT member 2
LigandBDBM50312105
Substrate/Competitorn/a
Meas. Tech.ChEMBL_1457496 (CHEMBL3367863)
IC50>30000±n/a nM
Citation Flaherty, DPSimpson, DSMiller, MMaki, BEZou, BShi, JWu, MMcManus, OBAubé, JLi, MGolden, JE Potent and selective inhibitors of the TASK-1 potassium channel through chemical optimization of a bis-amide scaffold. Bioorg Med Chem Lett24:3968-73 (2014) 
 
Potassium voltage-gated channel subfamily KQT member 2
Name:Potassium voltage-gated channel subfamily KQT member 2
Type:PROTEIN
Mol. Mass.:95883.20
Organism:Homo sapiens (Human)
Description:ChEMBL_1457496
Residue:872
BDBM50312105
NameBDBM50312105
Synonyms:2-methoxy-N-(3-(3-methylbenzamido)phenyl)benzamide | CHEMBL1081188
TypeSmall organic molecule
Emp. Form.C22H20N2O3
Mol. Mass.360.4058
SMILESCOc1ccccc1C(=O)Nc1cccc(NC(=O)c2cccc(C)c2)c1