Reaction Details
TargetPotassium channel subfamily K member 3
LigandBDBM50050547
Substrate/Competitorn/a
Meas. Tech.ChEMBL_1457501 (CHEMBL3367868)
IC50 10.0±n/a nM
Citation Flaherty, DPSimpson, DSMiller, MMaki, BEZou, BShi, JWu, MMcManus, OBAubé, JLi, MGolden, JE Potent and selective inhibitors of the TASK-1 potassium channel through chemical optimization of a bis-amide scaffold. Bioorg Med Chem Lett24:3968-73 (2014) 
 
Potassium channel subfamily K member 3
Name:Potassium channel subfamily K member 3
Type:Protein
Mol. Mass.:43534.71
Organism:Homo sapiens (Human)
Description:O14649
Residue:394
BDBM50050547
NameBDBM50050547
Synonyms:CHEMBL3182449
TypeSmall organic molecule
Emp. Form.C23H19F3N2O3
Mol. Mass.428.4038
SMILESCCOc1ccccc1C(=O)Nc1cccc(NC(=O)c2ccccc2C(F)(F)F)c1