Reaction Details
TargetPeroxisome proliferator-activated receptor gamma
LigandBDBM50050550
Substrate/Competitorn/a
Meas. Tech.ChEMBL_1458370 (CHEMBL3369563)
Kd 0.110000±n/a nM
Citation Tanaka, YGamo, KOyama, TOhashi, MWaki, MMatsuno, KMatsuura, NTokiwa, HMiyachi, H Molecular dynamics study-guided identification of cyclic amine structures as novel hydrophobic tail components of hPPAR¿ agonists. Bioorg Med Chem Lett24:4001-5 (2014) 
 
Peroxisome proliferator-activated receptor gamma
Name:Peroxisome proliferator-activated receptor gamma
Type:Nuclear Receptor
Mol. Mass.:57613.46
Organism:Homo sapiens (Human)
Description:P37231
Residue:505
BDBM50050550
NameBDBM50050550
Synonyms:CHEMBL3317867
TypeSmall organic molecule
Emp. Form.C36H42N2O4
Mol. Mass.566.7297
SMILESCCCOc1ccc(C[C@@H](Cc2ccccc2)C(O)=O)cc1CNC(=O)c1ccc(cc1)N1C2CC3CC(C2)CC1C3