Reaction Details
TargetMitogen-activated protein kinase 1
LigandBDBM50050858
Substrate/Competitorn/a
Meas. Tech.ChEMBL_1459265 (CHEMBL3367495)
IC50 31600±n/a nM
Citation Defaux, JAntoine, MLogé, CLe Borgne, MSchuster, TSeipelt, IAicher, BTeifel, MGünther, EGerlach, MMarchand, P Discovery of (7-aryl-1,5-naphthyridin-2-yl)ureas as dual inhibitors of ERK2 and Aurora B kinases with antiproliferative activity against cancer cells. Bioorg Med Chem Lett24:3748-52 (2014) 
 
Mitogen-activated protein kinase 1
Name:Mitogen-activated protein kinase 1
Type:Ser/Thr Protein Kinase
Mol. Mass.:41392.76
Organism:Homo sapiens (Human)
Description:P28482
Residue:360
BDBM50050858
NameBDBM50050858
Synonyms:CHEMBL3318032
TypeSmall organic molecule
Emp. Form.C17H20N6O
Mol. Mass.324.3803
SMILESCn1cc(cn1)-c1cnc2c(NC(=O)NC(C)(C)C)ccnc2c1