Reaction Details
TargetAurora kinase B
LigandBDBM50050854
Substrate/Competitorn/a
Meas. Tech.ChEMBL_1459266 (CHEMBL3367496)
IC50 1140±n/a nM
Citation Defaux, JAntoine, MLogé, CLe Borgne, MSchuster, TSeipelt, IAicher, BTeifel, MGünther, EGerlach, MMarchand, P Discovery of (7-aryl-1,5-naphthyridin-2-yl)ureas as dual inhibitors of ERK2 and Aurora B kinases with antiproliferative activity against cancer cells. Bioorg Med Chem Lett24:3748-52 (2014) 
 
Aurora kinase B
Name:Aurora kinase B
Type:Protein
Mol. Mass.:39327.72
Organism:Homo sapiens (Human)
Description:Q96GD4
Residue:344
BDBM50050854
NameBDBM50050854
Synonyms:CHEMBL3318028
TypeSmall organic molecule
Emp. Form.C19H16N6O
Mol. Mass.344.3699
SMILESCn1cc(cn1)-c1cnc2ccc(NC(=O)Nc3ccccc3)nc2c1