Reaction Details
TargetMitogen-activated protein kinase 1
LigandBDBM50050848
Substrate/Competitorn/a
Meas. Tech.ChEMBL_1459265 (CHEMBL3367495)
IC50 702±n/a nM
Citation Defaux, JAntoine, MLogé, CLe Borgne, MSchuster, TSeipelt, IAicher, BTeifel, MGünther, EGerlach, MMarchand, P Discovery of (7-aryl-1,5-naphthyridin-2-yl)ureas as dual inhibitors of ERK2 and Aurora B kinases with antiproliferative activity against cancer cells. Bioorg Med Chem Lett24:3748-52 (2014) 
 
Mitogen-activated protein kinase 1
Name:Mitogen-activated protein kinase 1
Type:Ser/Thr Protein Kinase
Mol. Mass.:41392.76
Organism:Homo sapiens (Human)
Description:P28482
Residue:360
BDBM50050848
NameBDBM50050848
Synonyms:CHEMBL3318026
TypeSmall organic molecule
Emp. Form.C20H22N4O3
Mol. Mass.366.4137
SMILESCOc1cc(ccc1O)-c1cnc2ccc(NC(=O)NC(C)(C)C)nc2c1