Reaction Details
TargetTyrosine-protein kinase Yes
LigandBDBM50050851
Substrate/Competitorn/a
Meas. Tech.ChEMBL_1459272 (CHEMBL3367502)
IC50>100000±n/a nM
Citation Defaux, JAntoine, MLogé, CLe Borgne, MSchuster, TSeipelt, IAicher, BTeifel, MGünther, EGerlach, MMarchand, P Discovery of (7-aryl-1,5-naphthyridin-2-yl)ureas as dual inhibitors of ERK2 and Aurora B kinases with antiproliferative activity against cancer cells. Bioorg Med Chem Lett24:3748-52 (2014) 
 
Tyrosine-protein kinase Yes
Name:Tyrosine-protein kinase Yes
Type:Protein
Mol. Mass.:60801.54
Organism:Homo sapiens (Human)
Description:P07947
Residue:543
BDBM50050851
NameBDBM50050851
Synonyms:CHEMBL3318023
TypeSmall organic molecule
Emp. Form.C18H18N4O2
Mol. Mass.322.3611
SMILESCCNC(=O)Nc1ccc2ncc(cc2n1)-c1ccc(OC)cc1