Reaction Details
TargetTyrosine-protein kinase Yes
LigandBDBM50050854
Substrate/Competitorn/a
Meas. Tech.ChEMBL_1459272 (CHEMBL3367502)
IC50>100000±n/a nM
Citation Defaux, JAntoine, MLogé, CLe Borgne, MSchuster, TSeipelt, IAicher, BTeifel, MGünther, EGerlach, MMarchand, P Discovery of (7-aryl-1,5-naphthyridin-2-yl)ureas as dual inhibitors of ERK2 and Aurora B kinases with antiproliferative activity against cancer cells. Bioorg Med Chem Lett24:3748-52 (2014) 
 
Tyrosine-protein kinase Yes
Name:Tyrosine-protein kinase Yes
Type:Protein
Mol. Mass.:60801.54
Organism:Homo sapiens (Human)
Description:P07947
Residue:543
BDBM50050854
NameBDBM50050854
Synonyms:CHEMBL3318028
TypeSmall organic molecule
Emp. Form.C19H16N6O
Mol. Mass.344.3699
SMILESCn1cc(cn1)-c1cnc2ccc(NC(=O)Nc3ccccc3)nc2c1