Reaction Details
TargetfMet-Leu-Phe receptor
LigandBDBM50051702
Substrate/Competitorn/a
Meas. Tech.ChEMBL_1452136 (CHEMBL3365082)
Kd 200±n/a nM
Citation Hayashi, RKitajima, TMizuguchi, HFujimoto, MYamaguchi, AKoga, SKoga, YOsada, SKodama, H Development of potent antagonists for formyl peptide receptor 1 based on Boc-Phe-D-Leu-Phe-D-Leu-Phe-OH. Bioorg Med Chem22:3824-8 (2014) 
 
fMet-Leu-Phe receptor
Name:fMet-Leu-Phe receptor
Type:Enzyme Catalytic Domain
Mol. Mass.:38456.14
Organism:Homo sapiens (Human)
Description:gi_4503779
Residue:350
BDBM50051702
NameBDBM50051702
Synonyms:CHEMBL3311036
TypeSmall organic molecule
Emp. Form.C41H61N5O8
Mol. Mass.751.9517
SMILESCC(C)C[C@H](NC(=O)OC(C)(C)C)C(=O)N[C@H](CC(C)C)C(=O)N[C@@H](Cc1ccccc1)C(=O)N[C@H](CC(C)C)C(=O)N[C@@H](Cc1ccccc1)C(O)=O