Reaction Details
TargetfMet-Leu-Phe receptor
LigandBDBM50051704
Substrate/Competitorn/a
Meas. Tech.ChEMBL_1452136 (CHEMBL3365082)
Kd 420±n/a nM
Citation Hayashi, RKitajima, TMizuguchi, HFujimoto, MYamaguchi, AKoga, SKoga, YOsada, SKodama, H Development of potent antagonists for formyl peptide receptor 1 based on Boc-Phe-D-Leu-Phe-D-Leu-Phe-OH. Bioorg Med Chem22:3824-8 (2014) 
 
fMet-Leu-Phe receptor
Name:fMet-Leu-Phe receptor
Type:Enzyme Catalytic Domain
Mol. Mass.:38456.14
Organism:Homo sapiens (Human)
Description:gi_4503779
Residue:350
BDBM50051704
NameBDBM50051704
Synonyms:CHEMBL3311034
TypeSmall organic molecule
Emp. Form.C41H53N5O8
Mol. Mass.743.8882
SMILESCC(C)C[C@@H](NC(=O)[C@H](Cc1ccccc1)NC(=O)OC(C)(C)C)C(=O)N[C@@H](Cc1ccccc1)C(=O)N[C@@H](C)C(=O)N[C@@H](Cc1ccccc1)C(O)=O