Reaction Details
TargetSerine/threonine-protein kinase Chk1
LigandBDBM50053233
Substrate/Competitorn/a
Meas. Tech.ChEMBL_1458470 (CHEMBL3370356)
IC50 9.8±n/a nM
Citation Song, PPeng, PHan, MCao, XMa, XLiu, TZhou, YHu, Y Design, synthesis and biological evaluation of thienopyridinones as Chk1 inhibitors. Bioorg Med Chem22:4882-92 (2014) 
 
Serine/threonine-protein kinase Chk1
Name:Serine/threonine-protein kinase Chk1
Type:Enzyme Catalytic Domain
Mol. Mass.:54443.02
Organism:Homo sapiens (Human)
Description:gi_166295192
Residue:476
BDBM50053233
NameBDBM50053233
Synonyms:CHEMBL3330234
TypeSmall organic molecule
Emp. Form.C20H21N5OS
Mol. Mass.379.479
SMILESCc1cc2c(NC3CCCNC3)c(-c3nc4ccccc4[nH]3)c(=O)[nH]c2s1