Reaction Details
TargetSerine/threonine-protein kinase Chk1
LigandBDBM50053235
Substrate/Competitorn/a
Meas. Tech.ChEMBL_1458470 (CHEMBL3370356)
IC50 2.3±n/a nM
Citation Song, PPeng, PHan, MCao, XMa, XLiu, TZhou, YHu, Y Design, synthesis and biological evaluation of thienopyridinones as Chk1 inhibitors. Bioorg Med Chem22:4882-92 (2014) 
 
Serine/threonine-protein kinase Chk1
Name:Serine/threonine-protein kinase Chk1
Type:Enzyme Catalytic Domain
Mol. Mass.:54443.02
Organism:Homo sapiens (Human)
Description:gi_166295192
Residue:476
BDBM50053235
NameBDBM50053235
Synonyms:CHEMBL3330232
TypeSmall organic molecule
Emp. Form.C20H20ClN5O2S
Mol. Mass.429.923
SMILESCOc1ccc2[nH]c(nc2c1)-c1c(N[C@H]2CCCNC2)c2cc(Cl)sc2[nH]c1=O