Reaction Details
TargetSerine/threonine-protein kinase Chk1
LigandBDBM50053252
Substrate/Competitorn/a
Meas. Tech.ChEMBL_1458470 (CHEMBL3370356)
IC50>10000±n/a nM
Citation Song, PPeng, PHan, MCao, XMa, XLiu, TZhou, YHu, Y Design, synthesis and biological evaluation of thienopyridinones as Chk1 inhibitors. Bioorg Med Chem22:4882-92 (2014) 
 
Serine/threonine-protein kinase Chk1
Name:Serine/threonine-protein kinase Chk1
Type:Enzyme Catalytic Domain
Mol. Mass.:54443.02
Organism:Homo sapiens (Human)
Description:gi_166295192
Residue:476
BDBM50053252
NameBDBM50053252
Synonyms:CHEMBL3330140
TypeSmall organic molecule
Emp. Form.C17H17N5OS
Mol. Mass.339.415
SMILESCNCCNc1c(-c2nc3ccccc3[nH]2)c(=O)[nH]c2sccc12