Reaction Details
TargetKinesin-like protein KIF11
LigandBDBM50431886
Substrate/Competitorn/a
Meas. Tech.ChEMBL_1457426 (CHEMBL3367369)
IC50 1300±n/a nM
Citation Yamamoto, JAmishiro, NKato, KOhta, YIno, YAraki, MTsujita, TOkamoto, STakahashi, TKusaka, HAkinaga, SYamashita, YNakai, RMurakata, C Synthetic studies on mitotic kinesin Eg5 inhibitors: synthesis and structure-activity relationships of novel 2,4,5-substituted-1,3,4-thiadiazoline derivatives. Bioorg Med Chem Lett24:3961-3 (2014) 
 
Kinesin-like protein KIF11
Name:Kinesin-like protein KIF11
Type:PROTEIN
Mol. Mass.:119138.97
Organism:Homo sapiens (Human)
Description:ChEMBL_1457426
Residue:1056
BDBM50431886
NameBDBM50431886
Synonyms:CHEMBL1413473
TypeSmall organic molecule
Emp. Form.C13H15N3O2S
Mol. Mass.277.342
SMILESCC(=O)NC1=NN(C(C)=O)C(C)(S1)c1ccccc1