Reaction Details
TargetPhosphatidylinositol 4,5-bisphosphate 3-kinase catalytic subunit gamma isoform
LigandBDBM25070
Substrate/Competitorn/a
Meas. Tech.ChEMBL_1453986 (CHEMBL3366680)
IC50 20±n/a nM
Citation Taha, MOAl-Sha'er, MAKhanfar, MAAl-Nadaf, AH Discovery of nanomolar phosphoinositide 3-kinase gamma (PI3Kż) inhibitors using ligand-based modeling and virtual screening followed by in vitro analysis. Eur J Med Chem84:454-65 (2014) 
 
Phosphatidylinositol 4,5-bisphosphate 3-kinase catalytic subunit gamma isoform
Name:Phosphatidylinositol 4,5-bisphosphate 3-kinase catalytic subunit gamma isoform
Type:Enzyme Subunit
Mol. Mass.:126470.30
Organism:Homo sapiens (Human)
Description:P48736
Residue:1102
BDBM25070
NameBDBM25070
Synonyms:4-[2-(4-chlorophenyl)ethyl]-6-{[(5Z)-4-oxo-2-sulfanylidene-1,3-thiazolidin-5-ylidene]methyl}-3,4-dihydro-2H-1,4-benzoxazin-3-one | benzo[1,4]oxazin-3-one, 10l
TypeSmall organic molecule
Emp. Form.C20H15ClN2O3S2
Mol. Mass.430.928
SMILESClc1ccc(CCN2C(=O)COc3ccc(\C=C4/SC(=S)NC4=O)cc23)cc1