Reaction Details
TargetPhosphatidylinositol 4,5-bisphosphate 3-kinase catalytic subunit gamma isoform
LigandBDBM15234
Substrate/Competitorn/a
Meas. Tech.ChEMBL_1453986 (CHEMBL3366680)
IC50 55000±n/a nM
Citation Taha, MOAl-Sha'er, MAKhanfar, MAAl-Nadaf, AH Discovery of nanomolar phosphoinositide 3-kinase gamma (PI3Kż) inhibitors using ligand-based modeling and virtual screening followed by in vitro analysis. Eur J Med Chem84:454-65 (2014) 
 
Phosphatidylinositol 4,5-bisphosphate 3-kinase catalytic subunit gamma isoform
Name:Phosphatidylinositol 4,5-bisphosphate 3-kinase catalytic subunit gamma isoform
Type:Enzyme Subunit
Mol. Mass.:126470.30
Organism:Homo sapiens (Human)
Description:P48736
Residue:1102
BDBM15234
NameBDBM15234
Synonyms:(1R,3R,5S,9R,18S)-18-(methoxymethyl)-1,5-dimethyl-6,11,16-trioxo-13,17-dioxapentacyclo[10.6.1.0^{2,10}.0^{5,9}.0^{15,19}]nonadeca-2(10),12(19),14-trien-3-yl acetate NSC221019 Wortmannin, Wm | cid_312145
TypeAntibiotic
Emp. Form.C23H24O8
Mol. Mass.428.4319
SMILES[H][C@@]12CCC(=O)[C@@]1(C)C[C@@H](OC(C)=O)C1=C2C(=O)c2occ3c2[C@]1(C)[C@@H](COC)OC3=O