Reaction Details
TargetPhosphatidylinositol 4,5-bisphosphate 3-kinase catalytic subunit gamma isoform
LigandBDBM25059
Substrate/Competitorn/a
Meas. Tech.ChEMBL_1453986 (CHEMBL3366680)
IC50 97±n/a nM
Citation Taha, MOAl-Sha'er, MAKhanfar, MAAl-Nadaf, AH Discovery of nanomolar phosphoinositide 3-kinase gamma (PI3Kż) inhibitors using ligand-based modeling and virtual screening followed by in vitro analysis. Eur J Med Chem84:454-65 (2014) 
 
Phosphatidylinositol 4,5-bisphosphate 3-kinase catalytic subunit gamma isoform
Name:Phosphatidylinositol 4,5-bisphosphate 3-kinase catalytic subunit gamma isoform
Type:Enzyme Subunit
Mol. Mass.:126470.30
Organism:Homo sapiens (Human)
Description:P48736
Residue:1102
BDBM25059
NameBDBM25059
Synonyms:4-benzyl-6-{[(5Z)-4-oxo-2-sulfanylidene-1,3-thiazolidin-5-ylidene]methyl}-3,4-dihydro-2H-1,4-benzoxazin-3-one | benzo[1,4]oxazin-3-one, 10a
TypeSmall organic molecule
Emp. Form.C19H14N2O3S2
Mol. Mass.382.456
SMILESO=C1NC(=S)S\C1=C/c1ccc2OCC(=O)N(Cc3ccccc3)c2c1