Reaction Details
TargetPhosphatidylinositol 4,5-bisphosphate 3-kinase catalytic subunit gamma isoform
LigandBDBM50189756
Substrate/Competitorn/a
Meas. Tech.ChEMBL_1453986 (CHEMBL3366680)
IC50 260±n/a nM
Citation Taha, MOAl-Sha'er, MAKhanfar, MAAl-Nadaf, AH Discovery of nanomolar phosphoinositide 3-kinase gamma (PI3Kż) inhibitors using ligand-based modeling and virtual screening followed by in vitro analysis. Eur J Med Chem84:454-65 (2014) 
 
Phosphatidylinositol 4,5-bisphosphate 3-kinase catalytic subunit gamma isoform
Name:Phosphatidylinositol 4,5-bisphosphate 3-kinase catalytic subunit gamma isoform
Type:Enzyme Subunit
Mol. Mass.:126470.30
Organism:Homo sapiens (Human)
Description:P48736
Residue:1102
BDBM50189756
NameBDBM50189756
Synonyms:5-[5-(2-fluoro-4-hydroxyphenyl)furan-2-ylmethylene]thiazolidine-2,4-dione | CHEMBL211068
TypeSmall organic molecule
Emp. Form.C14H8FNO4S
Mol. Mass.305.281
SMILESOc1ccc(-c2ccc(\C=C3/SC(=O)NC3=O)o2)c(F)c1