Reaction Details
TargetPhosphatidylinositol 4,5-bisphosphate 3-kinase catalytic subunit gamma isoform
LigandBDBM50189768
Substrate/Competitorn/a
Meas. Tech.ChEMBL_1453986 (CHEMBL3366680)
IC50 840±n/a nM
Citation Taha, MOAl-Sha'er, MAKhanfar, MAAl-Nadaf, AH Discovery of nanomolar phosphoinositide 3-kinase gamma (PI3Kż) inhibitors using ligand-based modeling and virtual screening followed by in vitro analysis. Eur J Med Chem84:454-65 (2014) 
 
Phosphatidylinositol 4,5-bisphosphate 3-kinase catalytic subunit gamma isoform
Name:Phosphatidylinositol 4,5-bisphosphate 3-kinase catalytic subunit gamma isoform
Type:Enzyme Subunit
Mol. Mass.:126470.30
Organism:Homo sapiens (Human)
Description:P48736
Residue:1102
BDBM50189768
NameBDBM50189768
Synonyms:5-[2,3']bifuranyl-5-ylmethylenethiazolidine-2,4-dione | CHEMBL209194
TypeSmall organic molecule
Emp. Form.C12H7NO4S
Mol. Mass.261.253
SMILESOC1=NC(=O)C(S1)=Cc1ccc(o1)-c1ccoc1