Reaction Details
TargetKappa-type opioid receptor
LigandBDBM50055065
Substrate/Competitorn/a
Meas. Tech.ChEMBL_1447926 (CHEMBL3379229)
Ki 5.4±n/a nM
Citation Bourgeois, CWerfel, EGalla, FLehmkuhl, KTorres-Gómez, HSchepmann, DKögel, BChristoph, TStraßburger, WEnglberger, WSoeberdt, MHüwel, SGalla, HJWünsch, B Synthesis and pharmacological evaluation of 5-pyrrolidinylquinoxalines as a novel class of peripherally restricted¿-opioid receptor agonists. J Med Chem57:6845-60 (2014) 
 
Kappa-type opioid receptor
Name:Kappa-type opioid receptor
Type:G Protein-Coupled Receptor (GPCR)
Mol. Mass.:42744.99
Organism:Cavia porcellus (domestic guinea pig)
Description:P41144
Residue:380
BDBM50055065
NameBDBM50055065
Synonyms:CHEMBL3323512
TypeSmall organic molecule
Emp. Form.C21H29Cl2N3O2
Mol. Mass.426.38
SMILESCN1CCN(C2C(CCCC12)N1CCC(O)C1)C(=O)Cc1ccc(Cl)c(Cl)c1