Reaction Details
TargetKappa-type opioid receptor
LigandBDBM50055070
Substrate/Competitorn/a
Meas. Tech.ChEMBL_1447926 (CHEMBL3379229)
Ki 15±n/a nM
Citation Bourgeois, CWerfel, EGalla, FLehmkuhl, KTorres-Gómez, HSchepmann, DKögel, BChristoph, TStraßburger, WEnglberger, WSoeberdt, MHüwel, SGalla, HJWünsch, B Synthesis and pharmacological evaluation of 5-pyrrolidinylquinoxalines as a novel class of peripherally restricted¿-opioid receptor agonists. J Med Chem57:6845-60 (2014) 
 
Kappa-type opioid receptor
Name:Kappa-type opioid receptor
Type:G Protein-Coupled Receptor (GPCR)
Mol. Mass.:42744.99
Organism:Cavia porcellus (domestic guinea pig)
Description:P41144
Residue:380
BDBM50055070
NameBDBM50055070
Synonyms:CHEMBL3323518
TypeSmall organic molecule
Emp. Form.C27H31Cl2N3O2
Mol. Mass.500.46
SMILESClc1ccc(CC(=O)N2CCN(C3CCCC(C23)N2CCCC2)C(=O)c2ccccc2)cc1Cl