Reaction Details
TargetKappa-type opioid receptor
LigandBDBM50021987
Substrate/Competitorn/a
Meas. Tech.ChEMBL_1447928 (CHEMBL3379231)
Ki 25±n/a nM
Citation Bourgeois, CWerfel, EGalla, FLehmkuhl, KTorres-Gómez, HSchepmann, DKögel, BChristoph, TStraßburger, WEnglberger, WSoeberdt, MHüwel, SGalla, HJWünsch, B Synthesis and pharmacological evaluation of 5-pyrrolidinylquinoxalines as a novel class of peripherally restricted¿-opioid receptor agonists. J Med Chem57:6845-60 (2014) 
 
Kappa-type opioid receptor
Name:Kappa-type opioid receptor
Type:G Protein-Coupled Receptor (GPCR)
Mol. Mass.:42744.99
Organism:Cavia porcellus (domestic guinea pig)
Description:P41144
Residue:380
BDBM50021987
NameBDBM50021987
Synonyms:CHEMBL3299002
TypeSmall organic molecule
Emp. Form.C27H33Cl2N3O
Mol. Mass.486.476
SMILES[H][C@@]12CCC[C@H](N3CCCC3)[C@@]1([H])N(CCN2Cc1ccccc1)C(=O)Cc1ccc(Cl)c(Cl)c1