Reaction Details
TargetKappa-type opioid receptor
LigandBDBM50055079
Substrate/Competitorn/a
Meas. Tech.ChEMBL_1447928 (CHEMBL3379231)
Ki 100±n/a nM
Citation Bourgeois, CWerfel, EGalla, FLehmkuhl, KTorres-Gómez, HSchepmann, DKögel, BChristoph, TStraßburger, WEnglberger, WSoeberdt, MHüwel, SGalla, HJWünsch, B Synthesis and pharmacological evaluation of 5-pyrrolidinylquinoxalines as a novel class of peripherally restricted¿-opioid receptor agonists. J Med Chem57:6845-60 (2014) 
 
Kappa-type opioid receptor
Name:Kappa-type opioid receptor
Type:G Protein-Coupled Receptor (GPCR)
Mol. Mass.:42744.99
Organism:Cavia porcellus (domestic guinea pig)
Description:P41144
Residue:380
BDBM50055079
NameBDBM50055079
Synonyms:CHEMBL3323526
TypeSmall organic molecule
Emp. Form.C24H31Cl2N3O4
Mol. Mass.496.427
SMILESCOC(=O)CC(=O)N1CCN(C2C(CCCC12)N1CCCC1)C(=O)Cc1ccc(Cl)c(Cl)c1