Reaction Details
TargetSigma non-opioid intracellular receptor 1
LigandBDBM50055065
Substrate/Competitorn/a
Meas. Tech.ChEMBL_1447934 (CHEMBL3379237)
Ki 818±n/a nM
Citation Bourgeois, CWerfel, EGalla, FLehmkuhl, KTorres-Gómez, HSchepmann, DKögel, BChristoph, TStraßburger, WEnglberger, WSoeberdt, MHüwel, SGalla, HJWünsch, B Synthesis and pharmacological evaluation of 5-pyrrolidinylquinoxalines as a novel class of peripherally restricted¿-opioid receptor agonists. J Med Chem57:6845-60 (2014) 
 
Sigma non-opioid intracellular receptor 1
Name:Sigma non-opioid intracellular receptor 1
Type:Protein
Mol. Mass.:25307.17
Organism:Cavia porcellus (Guinea pig)
Description:Q60492
Residue:223
BDBM50055065
NameBDBM50055065
Synonyms:CHEMBL3323512
TypeSmall organic molecule
Emp. Form.C21H29Cl2N3O2
Mol. Mass.426.38
SMILESCN1CCN(C2C(CCCC12)N1CCC(O)C1)C(=O)Cc1ccc(Cl)c(Cl)c1