Reaction Details
TargetSigma non-opioid intracellular receptor 1
LigandBDBM50055061
Substrate/Competitorn/a
Meas. Tech.ChEMBL_1447934 (CHEMBL3379237)
Ki 765±n/a nM
Citation Bourgeois, CWerfel, EGalla, FLehmkuhl, KTorres-Gómez, HSchepmann, DKögel, BChristoph, TStraßburger, WEnglberger, WSoeberdt, MHüwel, SGalla, HJWünsch, B Synthesis and pharmacological evaluation of 5-pyrrolidinylquinoxalines as a novel class of peripherally restricted¿-opioid receptor agonists. J Med Chem57:6845-60 (2014) 
 
Sigma non-opioid intracellular receptor 1
Name:Sigma non-opioid intracellular receptor 1
Type:Protein
Mol. Mass.:25307.17
Organism:Cavia porcellus (Guinea pig)
Description:Q60492
Residue:223
BDBM50055061
NameBDBM50055061
Synonyms:CHEMBL3323508
TypeSmall organic molecule
Emp. Form.C27H33Cl2N3O2
Mol. Mass.502.476
SMILESOC1CCN(C1)C1CCCC2C1N(CCN2Cc1ccccc1)C(=O)Cc1ccc(Cl)c(Cl)c1