Reaction Details
TargetKappa-type opioid receptor
LigandBDBM50055061
Substrate/Competitorn/a
Meas. Tech.ChEMBL_1447940 (CHEMBL3379243)
EC50 64±n/a nM
Citation Bourgeois, CWerfel, EGalla, FLehmkuhl, KTorres-Gómez, HSchepmann, DKögel, BChristoph, TStraßburger, WEnglberger, WSoeberdt, MHüwel, SGalla, HJWünsch, B Synthesis and pharmacological evaluation of 5-pyrrolidinylquinoxalines as a novel class of peripherally restricted¿-opioid receptor agonists. J Med Chem57:6845-60 (2014) 
 
Kappa-type opioid receptor
Name:Kappa-type opioid receptor
Type:G Protein-Coupled Receptor (GPCR)
Mol. Mass.:42648.76
Organism:Homo sapiens (Human)
Description:P41145
Residue:380
BDBM50055061
NameBDBM50055061
Synonyms:CHEMBL3323508
TypeSmall organic molecule
Emp. Form.C27H33Cl2N3O2
Mol. Mass.502.476
SMILESOC1CCN(C1)C1CCCC2C1N(CCN2Cc1ccccc1)C(=O)Cc1ccc(Cl)c(Cl)c1