Reaction Details
TargetSphingosine 1-phosphate receptor 1
LigandBDBM50055525
Substrate/Competitorn/a
Meas. Tech.ChEMBL_1452260 (CHEMBL3366172)
EC50 74±n/a nM
Citation Tian, YJin, JWang, XHu, JXiao, QZhou, WChen, XYin, D Discovery of oxazole and triazole derivatives as potent and selective S1P(1) agonists through pharmacophore-guided design. Eur J Med Chem85:1-15 (2014) 
 
Sphingosine 1-phosphate receptor 1
Name:Sphingosine 1-phosphate receptor 1
Type:Enzyme
Mol. Mass.:42836.02
Organism:Homo sapiens (Human)
Description:P21453
Residue:382
BDBM50055525
NameBDBM50055525
Synonyms:CHEMBL3341922
TypeSmall organic molecule
Emp. Form.C21H22F3N2O7P
Mol. Mass.502.3776
SMILESNC(CO)(CCc1ccc(cc1)-c1coc(n1)-c1ccc(OC(F)(F)F)cc1)COP(O)(O)=O