Reaction Details
TargetSphingosine 1-phosphate receptor 1
LigandBDBM50055531
Substrate/Competitorn/a
Meas. Tech.ChEMBL_1452260 (CHEMBL3366172)
EC50 94±n/a nM
Citation Tian, YJin, JWang, XHu, JXiao, QZhou, WChen, XYin, D Discovery of oxazole and triazole derivatives as potent and selective S1P(1) agonists through pharmacophore-guided design. Eur J Med Chem85:1-15 (2014) 
 
Sphingosine 1-phosphate receptor 1
Name:Sphingosine 1-phosphate receptor 1
Type:Enzyme
Mol. Mass.:42836.02
Organism:Homo sapiens (Human)
Description:P21453
Residue:382
BDBM50055531
NameBDBM50055531
Synonyms:CHEMBL3341916
TypeSmall organic molecule
Emp. Form.C18H29N4O5P
Mol. Mass.412.4204
SMILESCCCCCn1cc(nn1)-c1ccc(CCC(N)(CO)COP(O)(O)=O)cc1