Reaction Details
TargetSphingosine 1-phosphate receptor 1
LigandBDBM50055535
Substrate/Competitorn/a
Meas. Tech.ChEMBL_1452260 (CHEMBL3366172)
EC50 638±n/a nM
Citation Tian, YJin, JWang, XHu, JXiao, QZhou, WChen, XYin, D Discovery of oxazole and triazole derivatives as potent and selective S1P(1) agonists through pharmacophore-guided design. Eur J Med Chem85:1-15 (2014) 
 
Sphingosine 1-phosphate receptor 1
Name:Sphingosine 1-phosphate receptor 1
Type:Enzyme
Mol. Mass.:42836.02
Organism:Homo sapiens (Human)
Description:P21453
Residue:382
BDBM50055535
NameBDBM50055535
Synonyms:CHEMBL3342013
TypeSmall organic molecule
Emp. Form.C20H24FN4O5P
Mol. Mass.450.4005
SMILESNC(CO)(CCc1ccc(cc1)-c1cn(Cc2ccc(F)cc2)nn1)COP(O)(O)=O