Reaction Details
TargetSphingosine 1-phosphate receptor 1
LigandBDBM50055536
Substrate/Competitorn/a
Meas. Tech.ChEMBL_1452260 (CHEMBL3366172)
EC50 1287±n/a nM
Citation Tian, YJin, JWang, XHu, JXiao, QZhou, WChen, XYin, D Discovery of oxazole and triazole derivatives as potent and selective S1P(1) agonists through pharmacophore-guided design. Eur J Med Chem85:1-15 (2014) 
 
Sphingosine 1-phosphate receptor 1
Name:Sphingosine 1-phosphate receptor 1
Type:Enzyme
Mol. Mass.:42836.02
Organism:Homo sapiens (Human)
Description:P21453
Residue:382
BDBM50055536
NameBDBM50055536
Synonyms:CHEMBL3342012
TypeSmall organic molecule
Emp. Form.C21H27N4O5P
Mol. Mass.446.4366
SMILESCc1ccc(Cn2cc(nn2)-c2ccc(CCC(N)(CO)COP(O)(O)=O)cc2)cc1