Reaction Details
TargetSphingosine 1-phosphate receptor 1
LigandBDBM50055543
Substrate/Competitorn/a
Meas. Tech.ChEMBL_1452260 (CHEMBL3366172)
EC50 42±n/a nM
Citation Tian, YJin, JWang, XHu, JXiao, QZhou, WChen, XYin, D Discovery of oxazole and triazole derivatives as potent and selective S1P(1) agonists through pharmacophore-guided design. Eur J Med Chem85:1-15 (2014) 
 
Sphingosine 1-phosphate receptor 1
Name:Sphingosine 1-phosphate receptor 1
Type:Enzyme
Mol. Mass.:42836.02
Organism:Homo sapiens (Human)
Description:P21453
Residue:382
BDBM50055543
NameBDBM50055543
Synonyms:CHEMBL3342005
TypeSmall organic molecule
Emp. Form.C19H22ClN4O5P
Mol. Mass.452.829
SMILESNC(CO)(CCc1ccc(cc1)-c1cn(nn1)-c1ccc(Cl)cc1)COP(O)(O)=O