Reaction Details
TargetSphingosine 1-phosphate receptor 1
LigandBDBM50055552
Substrate/Competitorn/a
Meas. Tech.ChEMBL_1452260 (CHEMBL3366172)
EC50 108±n/a nM
Citation Tian, YJin, JWang, XHu, JXiao, QZhou, WChen, XYin, D Discovery of oxazole and triazole derivatives as potent and selective S1P(1) agonists through pharmacophore-guided design. Eur J Med Chem85:1-15 (2014) 
 
Sphingosine 1-phosphate receptor 1
Name:Sphingosine 1-phosphate receptor 1
Type:Enzyme
Mol. Mass.:42836.02
Organism:Homo sapiens (Human)
Description:P21453
Residue:382
BDBM50055552
NameBDBM50055552
Synonyms:CHEMBL3341929
TypeSmall organic molecule
Emp. Form.C22H27N2O6P
Mol. Mass.446.4333
SMILESCc1ccc(Cc2nc(co2)-c2ccc(CCC(N)(CO)COP(O)(O)=O)cc2)cc1