Reaction Details
TargetSphingosine 1-phosphate receptor 3
LigandBDBM50055530
Substrate/Competitorn/a
Meas. Tech.ChEMBL_1452261 (CHEMBL3366173)
EC50 1020±n/a nM
Citation Tian, YJin, JWang, XHu, JXiao, QZhou, WChen, XYin, D Discovery of oxazole and triazole derivatives as potent and selective S1P(1) agonists through pharmacophore-guided design. Eur J Med Chem85:1-15 (2014) 
 
Sphingosine 1-phosphate receptor 3
Name:Sphingosine 1-phosphate receptor 3
Type:G Protein-Coupled Receptor (GPCR)
Mol. Mass.:42278.13
Organism:Homo sapiens (Human)
Description:Q99500
Residue:378
BDBM50055530
NameBDBM50055530
Synonyms:CHEMBL3341917
TypeSmall organic molecule
Emp. Form.C21H25N2O6P
Mol. Mass.432.4068
SMILESCc1ccc(cc1)-c1nc(co1)-c1ccc(CCC(N)(CO)COP(O)(O)=O)cc1