Reaction Details
Target5-hydroxytryptamine receptor 7
LigandBDBM10755
Substrate/Competitorn/a
Meas. Tech.ChEMBL_1453162 (CHEMBL3364796)
EC50 17±n/a nM
Citation Medina, RAVázquez-Villa, HGómez-Tamayo, JCBenhamú, BMartín-Fontecha, Mde la Fuente, TCaltabiano, GHedlund, PBPardo, LLópez-Rodríguez, ML The extracellular entrance provides selectivity to serotonin 5-HT7 receptor antagonists with antidepressant-like behavior in vivo. J Med Chem57:6879-84 (2014) 
 
5-hydroxytryptamine receptor 7
Name:5-hydroxytryptamine receptor 7
Type:G Protein-Coupled Receptor (GPCR)
Mol. Mass.:53573.08
Organism:Homo sapiens (Human)
Description:P34969
Residue:479
BDBM10755
NameBDBM10755
Synonyms:14C-5-hydroxy tryptamine creatinine disulfate 5-HT 5-hydroxy tryptamine creatinine disulfate Serotonin | [3H]-5-HT
TypeSmall organic molecule
Emp. Form.C10H12N2O
Mol. Mass.176.2151
SMILESNCCc1c[nH]c2ccc(O)cc12