Reaction Details
Target5-hydroxytryptamine receptor 1A
LigandBDBM50055576
Substrate/Competitorn/a
Meas. Tech.ChEMBL_1453161 (CHEMBL3364795)
Ki>1000±n/a nM
Citation Medina, RAVázquez-Villa, HGómez-Tamayo, JCBenhamú, BMartín-Fontecha, Mde la Fuente, TCaltabiano, GHedlund, PBPardo, LLópez-Rodríguez, ML The extracellular entrance provides selectivity to serotonin 5-HT7 receptor antagonists with antidepressant-like behavior in vivo. J Med Chem57:6879-84 (2014) 
 
5-hydroxytryptamine receptor 1A
Name:5-hydroxytryptamine receptor 1A
Type:n/a
Mol. Mass.:46122.49
Organism:Homo sapiens (Human)
Description:n/a
Residue:422
BDBM50055576
NameBDBM50055576
Synonyms:CHEMBL3321797
TypeSmall organic molecule
Emp. Form.C24H36N2O
Mol. Mass.368.5554
SMILES[H][C@]12CCCC[C@]1([H])CN(CCCCCCCN1C(=O)Cc3ccccc13)CC2