Reaction Details
Target5-hydroxytryptamine receptor 1A
LigandBDBM50267832
Substrate/Competitorn/a
Meas. Tech.ChEMBL_1453161 (CHEMBL3364795)
Ki 219±n/a nM
Citation Medina, RAVázquez-Villa, HGómez-Tamayo, JCBenhamú, BMartín-Fontecha, Mde la Fuente, TCaltabiano, GHedlund, PBPardo, LLópez-Rodríguez, ML The extracellular entrance provides selectivity to serotonin 5-HT7 receptor antagonists with antidepressant-like behavior in vivo. J Med Chem57:6879-84 (2014) 
 
5-hydroxytryptamine receptor 1A
Name:5-hydroxytryptamine receptor 1A
Type:n/a
Mol. Mass.:46122.49
Organism:Homo sapiens (Human)
Description:n/a
Residue:422
BDBM50267832
NameBDBM50267832
Synonyms:1-[4-(3,4-Dihydroisoquinolin-2(1H)-yl)butyl]-1,3-dihydro-2Hindol-2-one | CHEMBL445334
TypeSmall organic molecule
Emp. Form.C21H24N2O
Mol. Mass.320.4281
SMILESO=C1Cc2ccccc2N1CCCCN1CCc2ccccc2C1