Reaction Details
TargetDynamin-2
LigandBDBM50055859
Substrate/Competitorn/a
Meas. Tech.ChEMBL_1458574 (CHEMBL3370892)
IC50 23600±n/a nM
Citation MacGregor, KAAbdel-Hamid, MKOdell, LRChau, NWhiting, ARobinson, PJMcCluskey, A Development of quinone analogues as dynamin GTPase inhibitors. Eur J Med Chem85:191-206 (2014) 
 
Dynamin-2
Name:Dynamin-2
Type:PROTEIN
Mol. Mass.:98236.76
Organism:Rattus norvegicus
Description:ChEMBL_1458574
Residue:870
BDBM50055859
NameBDBM50055859
Synonyms:CHEMBL3329966
TypeSmall organic molecule
Emp. Form.C18H14N2O4
Mol. Mass.322.3148
SMILESOc1ccc(NC2=CC(=O)C(Nc3ccc(O)cc3)=CC2=O)cc1