Reaction Details
TargetDynamin-2
LigandBDBM50055861
Substrate/Competitorn/a
Meas. Tech.ChEMBL_1458574 (CHEMBL3370892)
IC50 9100±n/a nM
Citation MacGregor, KAAbdel-Hamid, MKOdell, LRChau, NWhiting, ARobinson, PJMcCluskey, A Development of quinone analogues as dynamin GTPase inhibitors. Eur J Med Chem85:191-206 (2014) 
 
Dynamin-2
Name:Dynamin-2
Type:PROTEIN
Mol. Mass.:98236.76
Organism:Rattus norvegicus
Description:ChEMBL_1458574
Residue:870
BDBM50055861
NameBDBM50055861
Synonyms:CHEMBL3329968
TypeSmall organic molecule
Emp. Form.C20H14N2O6
Mol. Mass.378.335
SMILESOC(=O)c1ccc(NC2=CC(=O)C(Nc3ccc(cc3)C(O)=O)=CC2=O)cc1