Reaction Details
TargetSerine/threonine-protein kinase B-raf
LigandBDBM50055864
Substrate/Competitorn/a
Meas. Tech.ChEMBL_1458587 (CHEMBL3371130)
IC50>10000±n/a nM
Citation Liu, ZWang, YLin, HZuo, DWang, LZhao, YGong, P Design, synthesis and biological evaluation of novel thieno[3,2-d]pyrimidine derivatives containing diaryl urea moiety as potent antitumor agents. Eur J Med Chem85:215-27 (2014) 
 
Serine/threonine-protein kinase B-raf
Name:Serine/threonine-protein kinase B-raf
Type:Serine/threonine-protein kinase
Mol. Mass.:84446.00
Organism:Homo sapiens (Human)
Description:P15056
Residue:766
BDBM50055864
NameBDBM50055864
Synonyms:CHEMBL3326099
TypeSmall organic molecule
Emp. Form.C26H29ClN6OS
Mol. Mass.509.066
SMILESCCN(CC)CCCNc1nc(nc2ccsc12)-c1ccc(NC(=O)Nc2ccc(Cl)cc2)cc1