Reaction Details
TargetVascular endothelial growth factor receptor 1/2/3
LigandBDBM50055864
Substrate/Competitorn/a
Meas. Tech.ChEMBL_1458590 (CHEMBL3371133)
IC50>10000±n/a nM
Citation Liu, ZWang, YLin, HZuo, DWang, LZhao, YGong, P Design, synthesis and biological evaluation of novel thieno[3,2-d]pyrimidine derivatives containing diaryl urea moiety as potent antitumor agents. Eur J Med Chem85:215-27 (2014) 
 
Vascular endothelial growth factor receptor 1/2/3
Name:Vascular endothelial growth factor receptor 1/2/3
Synonyms:Vascular endothelial growth factor receptor
Type:n/a
Mol. Mass.:n/a
Description:ASSAY_ID of ChEMBL is 213950
Components:This complex has 3 components.
Component 1
Name:Vascular endothelial growth factor receptor 2
Type:Receptor Tyrosine Kinase
Mol. Mass.:151510.97
Organism:Homo sapiens (Human)
Description:P35968
Residue:1356
Component 2
Name:Vascular endothelial growth factor receptor 1
Synonyms:FLT FRT Fms-like tyrosine kinase 1 Tyrosine-protein kinase FRT VEGFR-1 VGFR1_HUMAN Vascular endothelial growth factor receptor 1 (FLT1) Vascular endothelial growth factor receptor 1 and 2 (Flt-1 and KDR) Vascular permeability factor receptor vascular endothelial growth factor/vascular permeability factor receptor
Type:Receptor Tyrosine Kinase
Mol. Mass.:150800.23
Organism:Homo sapiens (Human)
Description:P17948
Residue:1338
Component 3
Name:Vascular endothelial growth factor receptor 3
Synonyms:FLT-4 Fms-like tyrosine kinase 4 VEGFR-3 VGFR3_HUMAN Vascular endothelial growth factor receptor 3 (VEGFR-3) | Vascular endothelial growth factor receptor 3 (VEGFR3)
Type:Protein
Mol. Mass.:152749.58
Organism:Homo sapiens (Human)
Description:P35916-2
Residue:1363
BDBM50055864
NameBDBM50055864
Synonyms:CHEMBL3326099
TypeSmall organic molecule
Emp. Form.C26H29ClN6OS
Mol. Mass.509.066
SMILESCCN(CC)CCCNc1nc(nc2ccsc12)-c1ccc(NC(=O)Nc2ccc(Cl)cc2)cc1