Reaction Details
TargetCathepsin D
LigandBDBM50055932
Substrate/Competitorn/a
Meas. Tech.ChEMBL_1458603 (CHEMBL3371146)
IC50 92±n/a nM
Citation Grädler, UCzodrowski, PTsaklakidis, CKlein, MWerkmann, DLindemann, SMaskos, KLeuthner, B Structure-based optimization of non-peptidic Cathepsin D inhibitors. Bioorg Med Chem Lett24:4141-50 (2014) 
 
Cathepsin D
Name:Cathepsin D
Type:Enzyme
Mol. Mass.:44551.72
Organism:Homo sapiens (Human)
Description:Human proCathepsin D (SwissProt accession number P07339) was expressed in Sf9 cells, purified, and autoactivated.
Residue:412
BDBM50055932
NameBDBM50055932
Synonyms:CHEMBL3321932 | US9884814, Compound 212
TypeSmall organic molecule
Emp. Form.C28H36N8O4
Mol. Mass.548.6366
SMILESCOc1ccc(CC(=O)NC(=N)N[C@H](CC2CCCCC2)C(=O)NCc2cccc(c2)-c2nnn[nH]2)cc1OC